Buses – Are bus lines 101 and 102 one-way or two-way?

The various tourist attractions that list ways to get around Kyoto list buses 101 and 102 as good ways to get to popular temples from Kyoto station. In fact, some expressly say that they are leaving Kyoto Station.

It is not clear to me whether this is an accident or whether they really only go in one direction because they end up at a different station. As a counterpoint, the map of public transport from Google Maps suggests both ways.

Does anyone have first-hand experience?

I'm going to get 101 high quality Dofollow Instant Approved Blog Comments backlinks for SEO for $ 1

I'm going to get 101 high quality Dofollow Instant Approved Blog Comments backlinks for SEO

We all know the importance of links to all websites, and Google loves backlinks from high authority websites. Having an active website increases your organic ranking and visitor confidence. Therefore Blog Comments are indispensable for every post in search! I have a blog and I know what it takes to publish content that has a positive impact Traffic to websites without Spam!

Our service hot features:

  • Quality pages
  • 100% follow blog comments
  • Approved immediately
  • 100% manual submission
  • High flow of trust and citation flow
  • Domain authority = 25 to 90
  • Page authority = 25 to 65
  • 100% satisfactory results
  • Detailed report in Excel spreadsheet

We hate making false promises and love being committed!

Our commitments:

  • All the comments we leave lead to do-follow backlinks.
  • All comments are submitted manually.
  • All comments will be alive.
  • We are committed to providing you with a detailed Excel report.

Tag – high quality, SEO, link building, backlinks

I'm going to make 101 high quality Dofollow blog comments backlinks for $ 10

I'll make 101 high quality Dofollow blog comments backlinks

In the world of search engine optimization, commenting on blogs is without a doubt the most powerful link building process. And,

If the backlinks are "high authority", "trust flow", "citation flow", follow "and then don't forget" (Google Loves Them). Therefore we warmly welcome you to our Bl0g C0mments service. We are the only ones who sell ______ HIGH TF CF DA PA backlinks.

Google loves natural work, so we offer a manual service run by Real Humans.

Our service hot features:

– High quality pages
– 100% Follow Blog C0mments
– 100% manual submission
– High flow of trust and citation
– Domain Authority = 25 to 90
– Page authority = 25 to 65
– Accept Endless URLs and KEYWORDS
– Large number of referring domains
– 100% satisfactory results
– Detailed report in Excel spreadsheet
We hate making false promises and love being committed!

Our commitments:

Any comments we leave will lead to Do-Follow backLlnks.
All comments are submitted manually.
All comments will be alive.
We are committed to providing you with a detailed Excel report.
Chop-chop! Challenge me to improve your website with high quality DoFlowBlog elements – New strategy – Fresh links.

Get this offer now!

If you have any questions, please feel free to contact me!

Thanks a lot!

(tagsToTranslate) High (t) authorit (t) seo (t) backlink

Ubuntu – mysql_upgrade failed – Mariadb upgrade 10.1 -> 10.4

I just upgraded mariadb to use the changed version json Art.

I followed these steps:

  • unloaded --all-databases for backup
  • added a deb mirror link for release 10.4 to apt sources dir
  • mariadbs gpg key added
  • apt update && dist-upgrade (removes old 10.1 packages)
  • apt install mariadb-server (the initial gui / root pw question appears, another password entered)

When I try to log in, my password appears to be invalid or root no longer has rights:

ERROR 1045 (28000): Access denied for user 'root'@'localhost' (using password YES)
/etc/mysql/debian-start(20953): FATAL ERROR: Upgrade failed

I tried to fix it manually:

  • Stop the service
  • use mysqld_safe --skip-grant-tables
  • Password changed for root user

but the error remains.
If I a mysql_upgrade even with --verbose it fails:

mysql_upgrade
Phase 1/7: Checking and upgrading mysql database
Processing databases
mysql
mysql.column_stats                                 OK
mysql.columns_priv                                 OK
mysql.db                                           OK
mysql.event                                        OK
mysql.func                                         OK
mysql.global_priv                                  OK
mysql.gtid_slave_pos                               OK
mysql.help_category                                OK
mysql.help_keyword                                 OK
mysql.help_relation                                OK
mysql.help_topic                                   OK
mysql.index_stats                                  OK
mysql.innodb_index_stats                           OK
mysql.innodb_table_stats                           OK
mysql.plugin                                       OK
mysql.proc                                         OK
mysql.procs_priv                                   OK
mysql.proxies_priv                                 OK
mysql.roles_mapping                                OK
mysql.servers                                      OK
mysql.table_stats                                  OK
mysql.tables_priv                                  OK
mysql.time_zone                                    OK
mysql.time_zone_leap_second                        OK
mysql.time_zone_name                               OK
mysql.time_zone_transition                         OK
mysql.time_zone_transition_type                    OK
mysql.transaction_registry                         OK
mysql.user                                         OK
Phase 2/7: Installing used storage engines... Skipped
Phase 3/7: Fixing views
Phase 4/7: Running 'mysql_fix_privilege_tables'
ERROR 1242 (21000) at line 497: Subquery returns more than 1 row
FATAL ERROR: Upgrade failed

Would be great if there is someone who has seen this before and offers a solution: D

[Vn5socks.net] Car Update 24/7 – Good Socks 10h15 PM

LIFE ~ 167.71.191.155:9060 | 0.257 | new York | NY | 10020 | United States | Checked for vn5socks.net
LIFE ~ 167.99.60.252:9050 | 0,258 | Fort Worth | TX | 76104 | United States | Checked for vn5socks.net
LIFE ~ 68.183.246.73:9050 | 0.232 | los Angeles | CA. | unknown | United States | Checked for vn5socks.net
LIFE ~ 172.104.67.157:9050 | 0.063 | unknown | unknown | unknown | unknown | Checked for vn5socks.net
LIFE ~ 167.71.191.155:9070 | 0.259 | new York | NY | 10020 | United States | Checked for vn5socks.net
LIFE ~ 178.62.193.217:3130 | 0.261 | unknown | unknown | unknown | Russian Federation | Checked for vn5socks.net
LIFE ~ 157.230.9.227:9050 | 0.282 | Duluth | GA | 30097 | United States | Checked for vn5socks.net
LIFE ~ 82.165.137.115:7061 | 0.32 | unknown | unknown | unknown | Germany | Checked for vn5socks.net
LIFE ~ 178.159.36.10:9050 | 0.277 | unknown | unknown | unknown | Ukraine | Checked for vn5socks.net
LIFE ~ 42.112.20.116:7200 | 0,002 | Hanoi | 44 | unknown | Vietnam | Checked for vn5socks.net
LIFE ~ 192.169.244.80:54589 | 0.479 | unknown | unknown | unknown | unknown | Checked for vn5socks.net
LIFE ~ 139.162.76.176:9050 | 0,071 | Rotterdam | 11 | unknown | Netherlands | Checked for vn5socks.net
LIFE ~ 95.170.77.200:2010 | 0,295 | unknown | unknown | unknown | Netherlands | Checked for vn5socks.net
LIFE ~ 142.93.70.7:9100 | 0.266 | unknown | unknown | unknown | Canada | Checked for vn5socks.net
LIFE ~ 34.84.57.254:22080 | 0,178 | Houston | TX | 77072 | United States | Checked for vn5socks.net
LIFE ~ 199.247.22.236:33244 | 0.32 | yellow knife | NT | x1a2n3 | Canada | Checked for vn5socks.net
LIFE ~ 47.94.244.27:7302 | 0,101 | Ottawa | ON | k1y4h7 | Canada | Checked for vn5socks.net
LIFE ~ 220.79.34.109:2018 | 0.131 | Seoul | 11 | unknown | Korea, Republic of | Checked for vn5socks.net

Feuerhimmel
Reviewed by Feuerhimmel on
,
[Vn5socks.net] Auto Update 24/7 – Good Socks 10h15 PM
LIVE ~ 167.71.191.155:9060 | 0,257 | New York | NY | 10020 | United States | Checked at vn5socks.net
LIVE ~ 167.99.60.252:9050 | 0.258 | Fort Worth | TX | 76104 | United States | Checked at vn5socks.net
LIVE ~ 68.183.246.73:9050 | 0,232 | Los Angeles | CA | Unknown | United States | Checked at vn5socks.net
LIVE ~ 172.104.67.157:9050 | 0.063 | Unknown | Unknown | Unknown | Unknown | Checked at vn5socks.net
LIVE ~ 167.71.191.155:9070 | 0,259 | New York | NY |

Rating: 5

Memory – My Samsung Galaxy Tab 10.1 contains data that does not exist

Apparently, if I go into the settings and use memory, there is 1 GB of video and everything else is 5 GB in total, so I'm really confused about what 7 Gigs of Space uses. And all my apps are on my SD card. I open "my files" (which are supplied with the device) and when I go through the folders and remove things, only about 10 MB are removed, even though I have removed about 100 items. Please help, because I am very confused, how this works.

c ++ – Compile cuda 10.1 example error that is simpleCUBLAS

This part is a compilation part when I execute the "make" command.

/usr/local/cuda/bin/nvcc -ccbin g++ -I../../common/inc  -m64    -gencode arch=compute_30,code=compute_30 -o simpleCUBLAS.o -c simpleCUBLAS.cpp

And here is my error log. It has some cuda_runtime.h problem and I could not find why this code can not be compiled.

In file included from /usr/local/cuda-10.1/targets/x86_64-linux/include/channel_descriptor.h:61:0,
                 from /usr/local/cuda/bin/../targets/x86_64-linux/include/cuda_runtime.h:95,
                 from simpleCUBLAS.cpp:49:
/usr/local/cuda-10.1/targets/x86_64-linux/include/cuda_runtime_api.h:1788:101: error: use of enum ‘cudaDeviceP2PAttr’ without previous declaration
 extern __host__ __cudart_builtin__ cudaError_t CUDARTAPI cudaDeviceGetP2PAttribute(int *value, enum cudaDeviceP2PAttr attr, int srcDevice, int dstDevice);
                                                                                                     ^
/usr/local/cuda-10.1/targets/x86_64-linux/include/cuda_runtime_api.h:2248:25: error: expected ‘)’ before ‘*’ token
 typedef void (CUDART_CB *cudaStreamCallback_t)(cudaStream_t stream, cudaError_t status, void *userData);
                         ^
/usr/local/cuda-10.1/targets/x86_64-linux/include/cuda_runtime_api.h:2316:9: error: ‘cudaStreamCallback_t’ has not been declared
         cudaStreamCallback_t callback, void *userData, unsigned int flags);
         ^
/usr/local/cuda-10.1/targets/x86_64-linux/include/cuda_runtime_api.h:2483:88: error: use of enum ‘cudaStreamCaptureMode’ without previous declaration
 extern __host__ cudaError_t CUDARTAPI cudaStreamBeginCapture(cudaStream_t stream, enum cudaStreamCaptureMode mode);
                                                                                        ^
/usr/local/cuda-10.1/targets/x86_64-linux/include/cuda_runtime_api.h:2534:80: error: use of enum ‘cudaStreamCaptureMode’ without previous declaration
 extern __host__ cudaError_t CUDARTAPI cudaThreadExchangeStreamCaptureMode(enum cudaStreamCaptureMode *mode);
                                                                                ^
/usr/local/cuda-10.1/targets/x86_64-linux/include/cuda_runtime_api.h:2562:81: error: ‘cudaGraph_t’ has not been declared
 extern __host__ cudaError_t CUDARTAPI cudaStreamEndCapture(cudaStream_t stream, cudaGraph_t *pGraph);
                                                                                 ^
/usr/local/cuda-10.1/targets/x86_64-linux/include/cuda_runtime_api.h:2600:87: error: use of enum ‘cudaStreamCaptureStatus’ without previous declaration
 extern __host__ cudaError_t CUDARTAPI cudaStreamIsCapturing(cudaStream_t stream, enum cudaStreamCaptureStatus *pCaptureStatus);
                                                                                       ^
/usr/local/cuda-10.1/targets/x86_64-linux/include/cuda_runtime_api.h:2628:90: error: use of enum ‘cudaStreamCaptureStatus’ without previous declaration
 extern __host__ cudaError_t CUDARTAPI cudaStreamGetCaptureInfo(cudaStream_t stream, enum cudaStreamCaptureStatus *pCaptureStatus, unsigned long long *pId);
                                                                                          ^
/usr/local/cuda-10.1/targets/x86_64-linux/include/cuda_runtime_api.h:3012:64: error: ‘cudaExternalMemory_t’ was not declared in this scope
 extern __host__ cudaError_t CUDARTAPI cudaImportExternalMemory(cudaExternalMemory_t *extMem_out, const struct cudaExternalMemoryHandleDesc *memHandleDesc);
                                                                ^
/usr/local/cuda-10.1/targets/x86_64-linux/include/cuda_runtime_api.h:3012:86: error: ‘extMem_out’ was not declared in this scope
 extern __host__ cudaError_t CUDARTAPI cudaImportExternalMemory(cudaExternalMemory_t *extMem_out, const struct cudaExternalMemoryHandleDesc *memHandleDesc);
                                                                                      ^
/usr/local/cuda-10.1/targets/x86_64-linux/include/cuda_runtime_api.h:3012:98: error: expected primary-expression before ‘const’
 extern __host__ cudaError_t CUDARTAPI cudaImportExternalMemory(cudaExternalMemory_t *extMem_out, const struct cudaExternalMemoryHandleDesc *memHandleDesc);
                                                                                                  ^
/usr/local/cuda-10.1/targets/x86_64-linux/include/cuda_runtime_api.h:3012:154: error: expression list treated as compound expression in initializer (-fpermissive)
 extern __host__ cudaError_t CUDARTAPI cudaImportExternalMemory(cudaExternalMemory_t *extMem_out, const struct cudaExternalMemoryHandleDesc *memHandleDesc);
                                                                                                                                                          ^
/usr/local/cuda-10.1/targets/x86_64-linux/include/cuda_runtime_api.h:3066:88: error: ‘cudaExternalMemory_t’ has not been declared
 extern __host__ cudaError_t CUDARTAPI cudaExternalMemoryGetMappedBuffer(void **devPtr, cudaExternalMemory_t extMem, const struct cudaExternalMemoryBufferDesc *bufferDesc);
                                                                                        ^
/usr/local/cuda-10.1/targets/x86_64-linux/include/cuda_runtime_api.h:3121:111: error: ‘cudaExternalMemory_t’ has not been declared
 extern __host__ cudaError_t CUDARTAPI cudaExternalMemoryGetMappedMipmappedArray(cudaMipmappedArray_t *mipmap, cudaExternalMemory_t extMem, const struct cudaExternalMemoryMipmappedArrayDesc *mipmapDesc);
                                                                                                               ^
/usr/local/cuda-10.1/targets/x86_64-linux/include/cuda_runtime_api.h:3144:65: error: ‘cudaExternalMemory_t’ was not declared in this scope
 extern __host__ cudaError_t CUDARTAPI cudaDestroyExternalMemory(cudaExternalMemory_t extMem);
                                                                 ^
/usr/local/cuda-10.1/targets/x86_64-linux/include/cuda_runtime_api.h:3238:67: error: ‘cudaExternalSemaphore_t’ was not declared in this scope
 extern __host__ cudaError_t CUDARTAPI cudaImportExternalSemaphore(cudaExternalSemaphore_t *extSem_out, const struct cudaExternalSemaphoreHandleDesc *semHandleDesc);
                                                                   ^
/usr/local/cuda-10.1/targets/x86_64-linux/include/cuda_runtime_api.h:3238:92: error: ‘extSem_out’ was not declared in this scope
 extern __host__ cudaError_t CUDARTAPI cudaImportExternalSemaphore(cudaExternalSemaphore_t *extSem_out, const struct cudaExternalSemaphoreHandleDesc *semHandleDesc);
                                                                                            ^
/usr/local/cuda-10.1/targets/x86_64-linux/include/cuda_runtime_api.h:3238:104: error: expected primary-expression before ‘const’
 extern __host__ cudaError_t CUDARTAPI cudaImportExternalSemaphore(cudaExternalSemaphore_t *extSem_out, const struct cudaExternalSemaphoreHandleDesc *semHandleDesc);
                                                                                                        ^
/usr/local/cuda-10.1/targets/x86_64-linux/include/cuda_runtime_api.h:3238:163: error: expression list treated as compound expression in initializer (-fpermissive)
 extern __host__ cudaError_t CUDARTAPI cudaImportExternalSemaphore(cudaExternalSemaphore_t *extSem_out, const struct cudaExternalSemaphoreHandleDesc *semHandleDesc);
                                                                                                                                                                   ^
/usr/local/cuda-10.1/targets/x86_64-linux/include/cuda_runtime_api.h:3277:79: error: ‘cudaExternalSemaphore_t’ does not name a type
 extern __host__ cudaError_t CUDARTAPI cudaSignalExternalSemaphoresAsync(const cudaExternalSemaphore_t *extSemArray, const struct cudaExternalSemaphoreSignalParams *paramsArray, unsigned int numExtSems, c
                                                                               ^
/usr/local/cuda-10.1/targets/x86_64-linux/include/cuda_runtime_api.h:3320:77: error: ‘cudaExternalSemaphore_t’ does not name a type
 extern __host__ cudaError_t CUDARTAPI cudaWaitExternalSemaphoresAsync(const cudaExternalSemaphore_t *extSemArray, const struct cudaExternalSemaphoreWaitParams *paramsArray, unsigned int numExtSems, cudaS
                                                                             ^
/usr/local/cuda-10.1/targets/x86_64-linux/include/cuda_runtime_api.h:3342:68: error: ‘cudaExternalSemaphore_t’ was not declared in this scope
 extern __host__ cudaError_t CUDARTAPI cudaDestroyExternalSemaphore(cudaExternalSemaphore_t extSem);
                                                                    ^
/usr/local/cuda-10.1/targets/x86_64-linux/include/cuda_runtime_api.h:3741:102: error: use of enum ‘cudaFuncAttribute’ without previous declaration
 extern __host__ __cudart_builtin__ cudaError_t CUDARTAPI cudaFuncSetAttribute(const void *func, enum cudaFuncAttribute attr, int value);
                                                                                                      ^
/usr/local/cuda-10.1/targets/x86_64-linux/include/cuda_runtime_api.h:3855:79: error: ‘cudaHostFn_t’ has not been declared
 extern __host__ cudaError_t CUDARTAPI cudaLaunchHostFunc(cudaStream_t stream, cudaHostFn_t fn, void *userData);
                                                                               ^
In file included from /usr/local/cuda-10.1/targets/x86_64-linux/include/channel_descriptor.h:61:0,
                 from /usr/local/cuda/bin/../targets/x86_64-linux/include/cuda_runtime.h:95,
                 from simpleCUBLAS.cpp:49:
/usr/local/cuda-10.1/targets/x86_64-linux/include/cuda_runtime_api.h:6440:92: error: use of enum ‘cudaMemoryAdvise’ without previous declaration
 extern __host__ cudaError_t CUDARTAPI cudaMemAdvise(const void *devPtr, size_t count, enum cudaMemoryAdvise advice, int device);
                                                                                            ^
/usr/local/cuda-10.1/targets/x86_64-linux/include/cuda_runtime_api.h:6499:98: error: use of enum ‘cudaMemRangeAttribute’ without previous declaration
 extern __host__ cudaError_t CUDARTAPI cudaMemRangeGetAttribute(void *data, size_t dataSize, enum cudaMemRangeAttribute attribute, const void *devPtr, size_t count);
                                                                                                  ^
/usr/local/cuda-10.1/targets/x86_64-linux/include/cuda_runtime_api.h:6538:102: error: use of enum ‘cudaMemRangeAttribute’ without previous declaration
 extern __host__ cudaError_t CUDARTAPI cudaMemRangeGetAttributes(void **data, size_t *dataSizes, enum cudaMemRangeAttribute *attributes, size_t numAttributes, const void *devPtr, size_t count);
                                                                                                      ^
/usr/local/cuda-10.1/targets/x86_64-linux/include/cuda_runtime_api.h:8238:55: error: ‘cudaGraph_t’ was not declared in this scope
 extern __host__ cudaError_t CUDARTAPI cudaGraphCreate(cudaGraph_t *pGraph, unsigned int flags);
                                                       ^
/usr/local/cuda-10.1/targets/x86_64-linux/include/cuda_runtime_api.h:8238:68: error: ‘pGraph’ was not declared in this scope
 extern __host__ cudaError_t CUDARTAPI cudaGraphCreate(cudaGraph_t *pGraph, unsigned int flags);
                                                                    ^
/usr/local/cuda-10.1/targets/x86_64-linux/include/cuda_runtime_api.h:8238:76: error: expected primary-expression before ‘unsigned’
 extern __host__ cudaError_t CUDARTAPI cudaGraphCreate(cudaGraph_t *pGraph, unsigned int flags);
                                                                            ^
/usr/local/cuda-10.1/targets/x86_64-linux/include/cuda_runtime_api.h:8238:94: error: expression list treated as compound expression in initializer (-fpermissive)
 extern __host__ cudaError_t CUDARTAPI cudaGraphCreate(cudaGraph_t *pGraph, unsigned int flags);
                                                                                              ^
(syncopation..)

                                                                                               ^
/usr/local/cuda-10.1/targets/x86_64-linux/include/cuda_runtime_api.h:9126:125: error: ‘pErrorNode’ was not declared in this scope
 extern __host__ cudaError_t CUDARTAPI cudaGraphInstantiate(cudaGraphExec_t *pGraphExec, cudaGraph_t graph, cudaGraphNode_t *pErrorNode, char *pLogBuffer, size_t bufferSize);
                                                                                                                             ^
/usr/local/cuda-10.1/targets/x86_64-linux/include/cuda_runtime_api.h:9126:137: error: expected primary-expression before ‘char’
 extern __host__ cudaError_t CUDARTAPI cudaGraphInstantiate(cudaGraphExec_t *pGraphExec, cudaGraph_t graph, cudaGraphNode_t *pErrorNode, char *pLogBuffer, size_t bufferSize);
                                                                                                                                         ^
/usr/local/cuda-10.1/targets/x86_64-linux/include/cuda_runtime_api.h:9126:162: error: expected primary-expression before ‘bufferSize’
 extern __host__ cudaError_t CUDARTAPI cudaGraphInstantiate(cudaGraphExec_t *pGraphExec, cudaGraph_t graph, cudaGraphNode_t *pErrorNode, char *pLogBuffer, size_t bufferSize);
                                                                                                                                                                  ^
/usr/local/cuda-10.1/targets/x86_64-linux/include/cuda_runtime_api.h:9126:172: error: expression list treated as compound expression in initializer (-fpermissive)
 extern __host__ cudaError_t CUDARTAPI cudaGraphInstantiate(cudaGraphExec_t *pGraphExec, cudaGraph_t graph, cudaGraphNode_t *pErrorNode, char *pLogBuffer, size_t bufferSize);
                                                                                                                                                                            ^
/usr/local/cuda-10.1/targets/x86_64-linux/include/cuda_runtime_api.h:9160:72: error: ‘cudaGraphExec_t’ was not declared in this scope
 extern __host__ cudaError_t CUDARTAPI cudaGraphExecKernelNodeSetParams(cudaGraphExec_t hGraphExec, cudaGraphNode_t node, const struct cudaKernelNodeParams *pNodeParams);
                                                                        ^
/usr/local/cuda-10.1/targets/x86_64-linux/include/cuda_runtime_api.h:9160:100: error: ‘cudaGraphNode_t’ was not declared in this scope
 extern __host__ cudaError_t CUDARTAPI cudaGraphExecKernelNodeSetParams(cudaGraphExec_t hGraphExec, cudaGraphNode_t node, const struct cudaKernelNodeParams *pNodeParams);
                                                                                                    ^
/usr/local/cuda-10.1/targets/x86_64-linux/include/cuda_runtime_api.h:9160:122: error: expected primary-expression before ‘const’
 extern __host__ cudaError_t CUDARTAPI cudaGraphExecKernelNodeSetParams(cudaGraphExec_t hGraphExec, cudaGraphNode_t node, const struct cudaKernelNodeParams *pNodeParams);
                                                                                                                          ^
/usr/local/cuda-10.1/targets/x86_64-linux/include/cuda_runtime_api.h:9160:168: error: expression list treated as compound expression in initializer (-fpermissive)
 extern __host__ cudaError_t CUDARTAPI cudaGraphExecKernelNodeSetParams(cudaGraphExec_t hGraphExec, cudaGraphNode_t node, const struct cudaKernelNodeParams *pNodeParams);
                                                                                                                                                                        ^
/usr/local/cuda-10.1/targets/x86_64-linux/include/cuda_runtime_api.h:9185:55: error: ‘cudaGraphExec_t’ was not declared in this scope
 extern __host__ cudaError_t CUDARTAPI cudaGraphLaunch(cudaGraphExec_t graphExec, cudaStream_t stream);
                                                       ^
/usr/local/cuda-10.1/targets/x86_64-linux/include/cuda_runtime_api.h:9185:95: error: expected primary-expression before ‘stream’
 extern __host__ cudaError_t CUDARTAPI cudaGraphLaunch(cudaGraphExec_t graphExec, cudaStream_t stream);
                                                                                               ^
/usr/local/cuda-10.1/targets/x86_64-linux/include/cuda_runtime_api.h:9185:101: error: expression list treated as compound expression in initializer (-fpermissive)
 extern __host__ cudaError_t CUDARTAPI cudaGraphLaunch(cudaGraphExec_t graphExec, cudaStream_t stream);
                                                                                                     ^
/usr/local/cuda-10.1/targets/x86_64-linux/include/cuda_runtime_api.h:9206:60: error: ‘cudaGraphExec_t’ was not declared in this scope
 extern __host__ cudaError_t CUDARTAPI cudaGraphExecDestroy(cudaGraphExec_t graphExec);
                                                            ^
/usr/local/cuda-10.1/targets/x86_64-linux/include/cuda_runtime_api.h:9226:56: error: ‘cudaGraph_t’ was not declared in this scope
 extern __host__ cudaError_t CUDARTAPI cudaGraphDestroy(cudaGraph_t graph);
                                                        ^
Makefile:277: recipe for target 'simpleCUBLAS.o' failed
make: *** (simpleCUBLAS.o) Error 1

I think there are some cuda_rutime_api.h errors, but I do not know what the problem is.

I only use cuda-10.1 and use Ubuntu 16.04. Does anyone know this problem?

And other samples were compiled correctly.

[Vn5socks.net] Car Update 24/7 – Good Socks 11h10 PM

LIFE ~ 72.221.164.35:60670 | 0.287 | Unknown | Unknown | Unknown | United States | Checked for vn5socks.net
LIFE ~ 158.69.243.148:9999 | 0,343 | Lake Forest | CA. | 92630 | United States | Checked for vn5socks.net
LIFE ~ 70.168.93.201:17009 | 0,322 | Santa Barbara | CA. | Unknown | United States | Checked for vn5socks.net
LIFE ~ 5.189.224.84:10000 | 0.291 | Unknown | Unknown | Unknown | Unknown | Checked for vn5socks.net
LIFE ~ 167.71.146.116:9050 | 0,302 | new York | NY | 10020 | United States | Checked for vn5socks.net
LIFE ~ 72.217.158.195:54810 | 0.296 | Unknown | Unknown | Unknown | United States | Checked for vn5socks.net
LIFE ~ 103.51.15.108:30003 | 0,022 | Unknown | Unknown | Unknown | Unknown | Checked for vn5socks.net
LIFE ~ 79.104.222.121:9050 | 0.427 | Krasnoyarsk | 39 | Unknown | Russian Federation | Checked for vn5socks.net
LIFE ~ 183.102.171.77:8888 | 0.686 | Incheon | 12 | Unknown | Korea, Republic of | Checked for vn5socks.net
LIFE ~ 138.197.104.102:35627 | 0,258 | Wilmington | DE | 19880 | United States | Checked for vn5socks.net
LIFE ~ 47.94.244.27:7302 | 0,065 | Ottawa | ON | k1y4h7 | Canada | Checked for vn5socks.net
LIFE ~ 35.221.75.198:1081 | 0,101 | Ann Arbor | MI | 48104 | United States | Checked for vn5socks.net
LIFE ~ 18.182.177.151:9050 | 0,119 | Cambridge | MA | 02139 | United States | Checked for vn5socks.net
LIFE ~ 132.148.159.44:12397 | 0,448 | Minneapolis | MN | 55488 | United States | Checked for vn5socks.net
LIFE ~ 206.248.184.127:9050 | 0,302 | concord | ON | Unknown | Canada | Checked for vn5socks.net
LIFE ~ 136.243.14.152:42983 | 0.282 | neighbourhood | 12 | Unknown | Germany | Checked for vn5socks.net
LIFE ~ 5.9.157.99:60473 | 0,284 | Unknown | Unknown | Unknown | Germany | Checked for vn5socks.net
LIFE ~ 5.135.178.73:60060 | 0.277 | Unknown | Unknown | Unknown | Unknown | Checked for vn5socks.net

Feuerhimmel
Reviewed by Feuerhimmel on
,
[Vn5socks.net] Auto Update 24/7 – Good Socks 11h10 PM
LIVE ~ 72.221.164.35:60670 | 0,287 | Unknown | Unknown | Unknown | United States | Checked at vn5socks.net
LIVE ~ 158.69.243.148:9999 | 0,343 | Lake Forest | CA | 92630 | United States | Checked at vn5socks.net
LIVE ~ 70.168.93.201:17009 | 0,322 | Santa Barbara | CA | Unknown | United States | Checked at vn5socks.net
LIVE ~ 5,189,224.84:10000 | 0,291 | Unknown | Unknown | Unknown | Unknown | Checked at vn5socks.net
LIVE ~ 167.71.146.116:9050 | 0,302 | New York |

Rating: 5

,

Combinatorics – How many bit strings of length 8 have a weight of 5 starts with 101 OR ends with 11.

I'm about to solve this problem, but finding the final answer turns out to be problematic.

A: 101x xxxx = 32 strings beginning with 101
B: xxxx xx11 = 64 strings that end in 11
C: 101x xx11 = 8 strings with these two.

The number of strings with the weight five is 56.

It is also important to note that the number of strings beginning with 101, with five being equal to 10
and the number of strings ending in 11 with the weight five equals 20.

So I thought the answer was 22, d. H. A sum of 10 + 20 minus the two common strings, as this is one or a problem.